BDBM507045 2-Amino-8-(7-chloro-1,4-dihydroquinazolin-2-yl)-N,N-dipropyl-3H-1-benzazepine-4-carboxamide::US11046671, Example 6
SMILES CCCN(CCC)C(=O)C1=Cc2ccc(cc2N=C(N)C1)C1=NCc2ccc(Cl)cc2N1
InChI Key InChIKey=BLLBSIUWFNPOBV-UHFFFAOYSA-N
Data  2 EC50
  Tab Delimited (TSV)   2D SDfile   Computed 3D by Vconf -m prep SDfile
Find this compound or compounds like it in BindingDB:
Activity Spreadsheet -- Enzyme Inhibition Constant Data from BindingDB
Found 1 hit for monomerid = 507045
TargetToll-like receptor 7(Homo sapiens (Human))
Hoffmann-La Roche
US Patent
LigandPNGBDBM507045(2-Amino-8-(7-chloro-1,4-dihydroquinazolin-2-yl)-N,...)
Affinity DataEC50: >1.00E+5nM. Assay description: For TLR8 and TLR7 activity testing, HEK-Blue human TLR8 or TLR7 cells (Invivogen, San Diego, Calif., USA) are used, respectively. These cells are des...
Ligand InfoPC cidPC sid
In DepthDetails US Patent